BIOLOGICAL RECORDS
type: Concept

PALEOVEGETATION
type: Concept
change note: 2012-07-19 15:17:18.0 [mpmorahan] insert Definition (id: null text: Paleovegetation refers to plant species that were living at some time in the past. Indicators of past vegetation include pollen and plant macrofossils. Animal fossils and sedimentary indicators can also be used to reconstruct past vegetation. language code: en);
change note: 2012-06-26 14:07:14.0 [gee-cee] Insert Concept add broader relation (PALEOVEGETATION [fbd867cf-f7e8-4dbc-9fd2-2ccc0728350f,39965] - BIOLOGICAL RECORDS [5553fe9d-ab0a-4305-86a6-1f7f697e15e4,39951]);
in scheme: sciencekeywords
definition: Paleovegetation refers to plant species that were living at some time in the past. Indicators of past vegetation include pollen and plant macrofossils. Animal fossils and sedimentary indicators can also be used to reconstruct past vegetation.