PNEO
type: Concept
change note: 2022-03-28 13:53:54.0 [mmorahan] insert AltLabel (id: null category: primary text: PNEO language code: en); insert Definition (id: null text: Pléiades Neo is a PANchromatic + 6-band MultiSpectral Optical instrument. language code: en);
change note: 2022-03-28 13:48:38.0 [mmorahan] Insert Concept add broader relation (PNEO [fbf9d956-a972-44cc-9d84-84644e12505e,879786] - Imaging Spectrometers/Radiometers [944b7691-af37-4fb4-9393-c114e7997829,871722]);
in scheme: instruments
definition: Pléiades Neo is a PANchromatic + 6-band MultiSpectral Optical instrument.

Imaging Spectrometers/Radiometers
type: Concept