NATURAL HAZARDS
type: Concept

FLOODS
type: Concept
change note: 2012-07-02 08:41:30.0 [tbs1979] update Definition (Internet Geography); update Definition (Water covering previously dry area: a very large amount of water that has overflowed from a source such as a river or a broken pipe onto a previously dry area.);
change note: 2012-06-27 14:18:58.0 [tbs1979] update PrefLabel (FLOODS);
in scheme: sciencekeywords
definition: Water covering previously dry area: a very large amount of water that has overflowed from a source such as a river or a broken pipe onto a previously dry area.