SOLAR ENERGETIC PARTICLE PROPERTIES
type: Concept

PARTICLE DENSITY
type: Concept
in scheme: sciencekeywords
definition: The number of particles present per unit volume (typically a cubic centimeter).