MULTINATIONAL ORGANIZATIONS
type: Concept

ICES/EDC
type: Concept
in scheme: providers
definition: The initial work coordinated by ICES on marine pollution concerned the measurement of chemical contaminants (trace metals and trace organics) in commercial species of fish and shellfish. This programme began in 1972 with the initial aim of assessing the potential risk to human consumers caused by contaminants in fish and shellfish. Under the Cooperative ICES Monitoring Studies Programme, data are submitted by ICES Member Countries to the ICES Secretariat for compilation and handling. The early data, mainly on contaminants in fish and shellfish, were handled on paper until 1983, when the development of a computerized system was begun. At this time, ICES also offered its services as a data centre to the Oslo and Paris Commissions for handling the data collected under the Commission's Joint Monitoring Programme (JMP), which then covered the measurements of contaminants in fish/shellfish and sea water, with plans for measurements in sediments when feasible. This offer was accepted by the Commissions in 1983, with effect from 1984. Since then, the JMP has expanded greatly, so that now the ICES Environmental Data Centre contains data on a large number of contaminants in biota and sediments, and a smaller number of contaminants in sea water. In the past few years, the Data Centre has expanded additionally to accommodate new parameters covered under the North Sea Task Force Monitoring Master Plan, particularly biological effects monitoring results and data on fis h disease prevalence. Simultaneously with the development of contaminant monitoring programmes, programmes were developed to promote the comparability of chemical analytical data produced by participating laboratories, termed quality assurance (QA) programmes. Intercomparison exercises on the analysis of contaminants in marine media have represented a key component of the ICES QA programme. The Data Centre has been developed to store results of these and other intercomparison exercises. The Environmental Data Centr…