VALLEY
type: Concept

V SHAPED VALLEY
type: Concept
change note: 2023-03-03 08:19:32.0 [tstevens] update PrefLabel (V SHAPED VALLEY);
change note: 2013-04-01 09:14:46.0 [tbs1979] insert Definition (id: null text: A valley having a cross-sectional profile in the form of the letter V, commonly produced by stream erosion. language code: en);
change note: 2013-02-18 10:44:38.0 [tbs1979] Insert Concept add broader relation (V SHAPPED VALLEY [fdb4c687-916e-48ec-858e-6009cc763de3,82475] - VALLEY [87b01c3a-f64f-4764-8cb8-c40ebcd5a989,82471]);
in scheme: sciencekeywords
definition: A valley having a cross-sectional profile in the form of the letter V, commonly produced by stream erosion.