SMEX02
type: Concept
in scheme: projects
definition: Field experiments have been very successful at addressing a broad range of science questions in terrestrial hydrology. The data have been used in studies that went well beyond the algorithm research. For 2002, soil moisture and water cycle field experiments will be conducted that support the Aqua Advanced Microwave Scanning Radiometer (AMSR), NASAs Global Water and Energy Cycle Program, and future satellite missions for Terrestrial Hydrology. Main elements of the experiment are validation of AMSR brightness temperature and soil moisture retrievals, extension of instrument observations and algorithms to more challenging vegetation conditions, integration of land surface and boundary layer measurements, and the evaluation of new instrument technologies for soil moisture remote sensing. The Soil Moisture Experiments in 2002 (SMEX02) will be conducted in Iowa over a one month period between mid-June and mid-July. Information provided by http://hydrolab.arsusda.gov/smex02/

S - U
type: Concept