POTENTIAL DENSITY
type: Concept
in scheme: sciencekeywords
definition: Measurement of water density taking water's compressibility into account, provided no heat exchange of the water sample with its surroundings. This is important because of the potential temperature change of water at varying levels of pressure. That is, under high pressure, water is warmer (less potentially dense) than that same sample of water at low pressure (lower potential temperature and thus more potentially dense).

SALINITY/DENSITY
type: Concept