SMAP L-BAND RADIOMETER
type: Concept
in scheme: instruments
definition: [Source: SMAP home page Instrument Description, http://smap.jpl.nasa.gov/instrument/ ] The SMAP instrument architecture incorporates an L-band radar and an L-band radiometer that share a single feedhorn and parabolic mesh reflector. The reflector is offset from nadir and rotates about the nadir axis at 14.6 rpm, providing a conically scanning antenna beam with a surface incidence angle of approximately 40°. The reflector has a diameter of 6 m, providing a radiometer footprint of 40 km. The real-aperture radar footprint is 30 km, defined by the two-way antenna beamwidth. To obtain the desired high spatial resolution the radar employs range and Doppler discrimination. The radar data can be processed to yield resolution enhancement to 1-3 km spatial resolution. The science goal is to combine the attributes of the radar and radiometer observations in terms of their spatial resolution and sensitivity to soil moisture, surface roughness, and vegetation. Soil moisture will be estimated optimally at a resolution of 10 km and freeze-thaw state at a resolution of 1-3 km. The provision of constant incidence angle across the 1000-km swath simplifies the data processing and enables accurate repeat-pass estimation of soil moisture and freeze/thaw change. Group: Instrument_Details Entry_ID: SMAP L-BAND RADIOMETER Group: Instrument_Identification Instrument_Category: Earth Remote Sensing Instruments Instrument_Class: Passive Remote Sensing Instrument_Type: Spectrometers/Radiometers Instrument_Subtype: Imaging Spectrometers/Radiometers Short_Name: SMAP L-BAND RADIOMETER Long_Name: SMAP L-Band Radiometer End_Group Group: Instrument_Associated_Sensors Short_Name: SMAP L-BAND RADAR End_Group Group: Associated_Platforms Short_Name: SMAP End_Group Group: Spectral_Frequency_Information Spectral_Frequency_Coverage_Range: 1.41 GHz End_Group Online_Resource: http://smap.jpl.nasa.gov/instrument/ Online_Resource: http://nasascience.nasa.gov/missions/smap Online_Resource: http://eospso.gsfc.nas…

Imaging Spectrometers/Radiometers
type: Concept