CA/NFLD/DME/GS
type: Concept
in scheme: providers
definition: Metallogenic studies of gold mineralization in western and central Newfoundland. Magmatic-hosted Ni-Cu-Co-PGE mineralization in northern and western Labrador. Summary Provided By: http://www.nr.gov.nl.ca/mines&en/geosurvey/aboutus/sections/deposits/kerr.stm

CANADA
type: Concept