DATA PROCESSING SERVICES
type: Concept

WEB COORDINATE TRANSFORMATION SERVICE
type: Concept
in scheme: sciencekeywords
definition: Transforms the coordinates of feature or coverage data from one coordinate reference system (CRS) to another, including “transformations”, “conversions”, rectification, and orthorectification.