Microgravity
contributor: AAS Frey.Katie
broader: Space research
definition: The state or condition where the force of gravity is very weak, e.g. the weightlessness experienced inside an orbiting spacecraft.
modified: 2020-11-10T19:34:08.629Z
modified: 2020-11-10T19:33:58.172Z
type: Concept

Space research
type: Concept
narrower: Microgravity