Star clusters
type: Concept
narrower: Moving clusters

Moving clusters
contributor: AAS Frey.Katie Admin
related: Moving cluster parallax
broader: Star clusters
definition: A group of stars dynamically associated so that they have a common motion with respect to the local standard of rest.
modified: 2020-11-04T16:36:36.687Z
modified: 2020-11-04T16:36:22.49Z
type: Concept

Moving cluster parallax
type: Concept
related: Moving clusters