Opposition
scope note: Refers to planet position
contributor: AAS Frey.Katie
broader: Astronomical location
definition: The position of a solar system body having its orbit outside that of the Earth when the Earth is in a line between the Sun and the body. At opposition the body has a solar elongation of 180°, and is closest to the Earth. It will, in principle, be visible throughout the night. It will rise in the east as the Sun sets in the west and it will set as the Sun rises. This is because, at opposition, the body and the Sun are 12 hours apart. The inner planets can never be in opposition. The opposite of opposition is conjunction.
modified: 2020-11-17T19:06:33.643Z
modified: 2020-11-17T19:06:23.648Z
type: Concept

Astronomical location
type: Concept
narrower: Opposition