Perigee
contributor: AAS Frey.Katie
broader: Apsides
definition: The point in the orbit of a body revolving around the Earth at which it is nearest to the Earth; opposite of apogee.
modified: 2020-11-17T19:24:20.547Z
modified: 2020-11-17T19:24:09.933Z
type: Concept

Apsides
type: Concept
narrower: Perigee