Perihelion
contributor: AAS Frey.Katie
broader: Apsides
definition: The nearest point to the Sun in an orbit around the Sun; opposite of aphelion.
modified: 2020-11-17T19:24:59.17Z
modified: 2020-11-17T19:24:45.569Z
type: Concept

Apsides
type: Concept
narrower: Perihelion