Photoelectric magnitude
contributor: AAS Frey.Katie
broader: Apparent magnitude
definition: The magnitude of an object as measured with a photoelectric photometer.
modified: 2020-11-17T19:27:06.098Z
modified: 2020-11-17T19:26:56.483Z
type: Concept

Apparent magnitude
type: Concept
narrower: Photoelectric magnitude