Apparent magnitude
type: Concept
narrower: Photovisual magnitude

Photovisual magnitude
contributor: AAS Frey.Katie
broader: Apparent magnitude
definition: Magnitude defined for the combination of a photographic plate and a yellow filter, approximating the spectral sensitivity of the eye.
modified: 2020-11-17T19:34:42.314Z
modified: 2020-11-17T19:34:32.633Z
type: Concept