Planetary magnetospheres
type: Concept
narrower: Plasmapause

Plasmapause
contributor: AAS Frey.Katie
broader: Planetary magnetospheres
definition: The sharp outer boundary of the plasmasphere, at which the plasma density decreases by a factor of 100 or more.
modified: 2020-11-17T19:36:50.077Z
modified: 2020-11-17T19:36:40.468Z
type: Concept