Active galactic nuclei
type: Concept
narrower: Radio lobes

Radio lobes
scope note: Radio source feature
contributor: AAS Frey.Katie Admin
broader: Active galactic nuclei
definition: An extended region of diffuse radio emission, often dumbbell shaped, that surrounds a radio galaxy.
modified: 2020-11-03T21:10:52.318Z
modified: 2020-11-03T21:10:39.88Z
type: Concept