Novae
type: Concept
narrower: Recurrent novae

Recurrent novae
contributor: AAS Frey.Katie Admin
broader: Novae
definition: A cataclysmic variable star that undergoes outbursts similar to those found in novae.
modified: 2020-11-03T21:15:49.805Z
modified: 2020-11-03T21:15:36.383Z
type: Concept