Early universe
type: Concept
narrower: Baryogenesis

Baryogenesis
contributor: AAS Frey.Katie
alternative label: Matter-antimatter asymmetry
broader: Early universe
definition: The hypothetical mechanism of creating the baryon asymmetry in the Universe. Explaining the observed matter asymmetry is an important open question in physical cosmology.
modified: 2020-11-03T18:41:56.428Z
modified: 2020-11-03T18:41:20.043Z
type: Concept