Charged black holes
type: Concept
narrower: Reissner-Nordström black holes

Nonrotating black holes
type: Concept
narrower: Reissner-Nordström black holes

Reissner-Nordström black holes
alternative label: Reissner-Nordstrom black holes
alternative label: Reissner Nordstrom black holes
alternative label: Reissner Nordström black holes
broader: Charged black holes
broader: Nonrotating black holes
type: Concept
modified: 2020-11-03T21:29:16.418Z
modified: 2020-11-03T21:28:56.319Z
definition: A type of electrically charged black hole that is spherically symmetric and non-rotating. Another type of such objects is the Kerr-Newman black hole.
contributor: AAS Frey.Katie Admin