Dwarf spheroidal galaxies
type: Concept
narrower: Sagittarius dwarf spheroidal galaxy

Sagittarius dwarf spheroidal galaxy
contributor: AAS Frey.Katie Admin
alternative label: Sagittarius dwarf elliptical galaxy
alternative label: Sgr dE
alternative label: Sag DEG
alternative label: Sgr dSph
modified: 2020-11-04T14:35:14.192Z
modified: 2020-11-04T14:34:54.243Z
type: Concept
broader: Dwarf spheroidal galaxies
definition: A satellite galaxy of the Milky Way discovered only in 1994 since most of it is obscured by the Galactic disc. At only 50,000 light years distant from our Galaxy's core, it is travelling in a polar orbit around the Galaxy. Our Galaxy is slowly devouring it, as evidenced by a filament which stretches around the Milky Way's core like a gossamer loop. It is only about 10,000 light-years in diameter, in comparison to the Milky Way's diameter of 100,000 light years. It is populated by old yellowish stars has four known globular clusters: M54, Arp 2, Terzan 7, and Terzan 8. It should not be confused with the Sagittarius Dwarf Irregular Galaxy.