Schwarzschild metric
narrower: Schwarzschild radius
modified: 2020-11-17T20:37:25.101Z
modified: 2020-11-17T20:37:33.623Z
alternative label: Schwarzschild solution
alternative label: Schwarzschild vacuum
contributor: AAS Frey.Katie
type: Concept
definition: In general relativity, the metric that describes the space-time outside a static mass with spherically symmetric distribution.
broader: Spacetime metric

Spacetime metric
type: Concept
narrower: Schwarzschild metric

Schwarzschild radius
type: Concept
broader: Schwarzschild metric