Spectrometers
contributor: AAS Frey.Katie Admin
broader: Astronomical instrumentation
definition: A spectrograph in which the spectrum is recorded by electronic means so that wavelength, intensity, etc. can be measured. An instrument for determining the distribution of energies in a beam of particles.
narrower: Mass spectrometers
modified: 2020-11-24T17:22:21.016Z
modified: 2020-11-04T16:27:43.754Z
type: Concept

Mass spectrometers
type: Concept
broader: Spectrometers

Astronomical instrumentation
type: Concept
narrower: Spectrometers