Surveys
type: Concept
narrower: Star counts

Astronomical models
type: Concept
narrower: Star counts

Star counts
broader: Astronomical models
broader: Surveys
contributor: AAS Frey.Katie Admin
alternative label: Star distribution
alternative label: Stellar statistics
definition: The number of stars that appear in a given region of sky, usually counted on a photographic plate or CCD image.
modified: 2020-11-04T16:41:44.402Z
modified: 2020-11-04T16:41:27.255Z
type: Concept