Parallax
type: Concept
narrower: Statistical parallax

Statistical parallax
contributor: AAS Frey.Katie
broader: Parallax
definition: The mean parallax of a group of stars that are all at approximately the same distance, as determined from their radial velocities and proper motions.
modified: 2020-11-19T16:13:54.906Z
modified: 2020-11-19T16:13:41.766Z
type: Concept