T associations
contributor: AAS Frey.Katie Admin
alternative label: T-association
broader: Stellar associations
definition: A stellar association containing many T Tauri stars. Examples include the Taurus-Auriga T association, the nearby TW Hydrae association, and Vela T1 and T2.
modified: 2020-11-05T20:29:22.793Z
modified: 2020-11-05T20:29:12.056Z
type: Concept

Stellar associations
type: Concept
narrower: T associations