Thermosphere
contributor: AAS Frey.Katie
broader: Earth atmosphere
definition: The region of the upper atmosphere in which temperature increases continuously with height, starting at roughly 100 km. The thermosphere includes the exosphere and most of the ionosphere.
modified: 2020-11-19T16:36:49.915Z
modified: 2020-11-19T16:36:35.857Z
type: Concept

Earth atmosphere
type: Concept
narrower: Thermosphere