Troposphere
contributor: AAS Frey.Katie
broader: Earth atmosphere
definition: The lower part of the Earth's atmosphere in which temperature decreases with height, except for local areas of temperature inversion.
modified: 2020-11-19T16:43:03.864Z
modified: 2020-11-19T16:42:53.638Z
type: Concept

Earth atmosphere
type: Concept
narrower: Troposphere