Orbital anomalies
type: Concept
narrower: True anomaly

True anomaly
contributor: AAS Frey.Katie
broader: Orbital anomalies
definition: One of the standard orbital elements, which is the angle measured at the focus nearest the periapsis of an elliptical orbit, between the periapsis and the radius vector from the focus to the orbiting body.
modified: 2020-11-19T16:43:39.594Z
modified: 2020-11-19T16:43:29.981Z
type: Concept