Astrometry
type: Concept
narrower: Bolometric correction

Bolometric correction
contributor: AAS Frey.Katie
broader: Astrometry
definition: The difference between the visual magnitude and bolometric magnitude.
modified: 2020-11-03T18:53:22.541Z
modified: 2020-11-03T18:53:11.378Z
type: Concept