Water vapor
preferred label: Water vapour
alternative label: Aqueous vapour
alternative label: Aqueous vapor
type: Concept
contributor: AAS Frey.Katie Admin
contributor: AAS Frey.Katie
broader: Greenhouse gases
broader: Planetary atmospheres
definition: Water in the gaseous state. Atmospheric water in vapor form; one of the most important components of the atmosphere.
modified: 2020-11-19T17:02:26.722Z
modified: 2021-09-27T15:44:50.307Z

Planetary atmospheres
type: Concept
narrower: Water vapor

Greenhouse gases
type: Concept
narrower: Water vapor