Astrobiology
type: Concept
narrower: Xenobiology

Xenobiology
contributor: AAS Frey.Katie
broader: Astrobiology
definition: The study of synthesizing and manipulating biological devices and systems.
modified: 2020-11-19T17:11:32.435Z
modified: 2020-11-19T17:11:22.812Z
type: Concept