DZ stars
type: Concept
definition: A white dwarf whose spectrum shows metal lines only; no H or He.
creator: AAS Frey.Katie
alternative label: DZ white dwarf stars
alternative label: DZ white dwarf
contributor: AAS Frey.Katie Admin
modified: 2020-11-09T21:28:08.847Z
modified: 2020-11-04T21:17:06.121Z
created: 2017-01-23T19:32:01Z
broader: White dwarf stars

White dwarf stars
type: Concept
narrower: DZ stars