Astrostatistics distributions
type: Concept
narrower: Normal distribution

Normal distribution
contributor: AAS Frey.Katie
modified: 2020-11-10T19:43:01.312Z
modified: 2020-11-10T19:42:52.195Z
broader: Astrostatistics distributions
type: Concept
creator: AAS Frey.Katie
definition: A theoretical frequency distribution for a set of variable data, usually represented by a bell-shaped curve with a mean at the center of the curve and tail widths proportional to the standard deviation of the data about the mean.
created: 2018-08-27T18:50:38Z