Recombination
type: Concept
narrower: Radiative recombination

Radiative recombination
created: 2018-09-13T19:59:46Z
modified: 2020-11-17T20:04:44.568Z
modified: 2020-11-17T20:04:35.039Z
contributor: AAS Frey.Katie
broader: Recombination
type: Concept
creator: AAS Frey.Katie Admin
definition: The process by which an ionized atom binds a free electron in a plasma to produce a new atomic state with the subsequent radiation of photons.