Atomic physics
type: Concept
narrower: Transition probabilities

Transition probabilities
modified: 2020-11-04T22:01:11.919Z
modified: 2020-11-04T22:00:57.049Z
created: 2018-09-13T20:01:23Z
definition: The probability that a quantum-mechanical system will make a transition from a given initial state to a given final state.
creator: AAS Frey.Katie Admin
broader: Atomic physics
contributor: AAS Frey.Katie Admin
type: Concept