Collisional processes
scope note: Collisional processes within planetary systems.
creator: AAS Frey.Katie Admin
created: 2022-06-15T19:13:06.506Z
contributor: AAS Frey.Katie Admin
broader: Planetary science
modified: 2022-06-15T19:13:44.093Z
type: Concept

Planetary science
type: Concept
narrower: Collisional processes