Comparison stars
contributor: AAS Frey.Katie
broader: Standard stars
definition: A non-variable star used to monitor the variations of another nearby star.
modified: 2020-10-26T20:24:50.288Z
modified: 2020-10-26T20:24:37.379Z
type: Concept

Standard stars
type: Concept
narrower: Comparison stars