Celestial sphere
type: Concept
narrower: Constellations

Constellations
contributor: AAS Frey.Katie
broader: Celestial sphere
definition: A grouping of conspicuous stars that, when seen from Earth, form an apparent pattern. The sky is divided into 88 constellations.
modified: 2020-10-27T13:20:24.407Z
modified: 2020-10-27T13:20:09.273Z
type: Concept