Calibration
type: Concept
narrower: Flux calibration

Flux calibration
contributor: AAS Frey.Katie Admin
contributor: AAS Frey.Katie
modified: 2020-12-03T20:04:16.397Z
modified: 2020-11-03T21:16:10.501Z
definition: The calibration of the flux received by a detector in terms of absolute units.
type: Concept
broader: Spectrophotometry
broader: Calibration

Spectrophotometry
type: Concept
narrower: Flux calibration