Interplanetary gas
contributor: AAS Frey.Katie
broader: Interplanetary medium
definition: Electrically charged particles of the solar wind and gas liberated from comets within the solar system.
modified: 2020-11-10T17:42:41.931Z
modified: 2020-11-10T17:42:31.611Z
type: Concept

Interplanetary medium
type: Concept
narrower: Interplanetary gas