Stellar-interstellar interactions
type: Concept
narrower: Interstellar medium wind

Interstellar medium wind
scope note: Wind that a star perceives from the ISM.
contributor: AAS Frey.Katie Admin
alternative label: Interstellar wind
broader: Stellar-interstellar interactions
modified: 2020-11-24T16:24:12.746Z
type: Concept