Iron meteorites
contributor: AAS Frey.Katie Admin
broader: Meteorites
definition: A meteorite which is composed mainly of iron mixed with smaller amounts of nickel. Iron meteorites make up about 4.4% of all meteorites.
modified: 2020-11-05T16:01:52.966Z
modified: 2020-11-05T16:01:38.117Z
type: Concept

Meteorites
type: Concept
narrower: Iron meteorites