Low surface brightness galaxies
type: Concept
narrower: L galaxies

L galaxies
contributor: AAS Frey.Katie
alternative label: L-galaxies
broader: Low surface brightness galaxies
definition: In Morgan's classification, an elongated galaxy of low surface brightness.
modified: 2020-11-10T18:13:38.095Z
modified: 2020-11-10T18:13:26.575Z
type: Concept