Late-type galaxies
contributor: AAS Frey.Katie Admin
alternative label: Late type galaxies
broader: Galaxies
definition: In the Hubble classification, a galaxy on the left part of the Hubble sequence.
modified: 2020-11-03T16:37:22.213Z
modified: 2020-11-03T16:37:09.142Z
type: Concept

Galaxies
type: Concept
narrower: Late-type galaxies