Line of sight
contributor: AAS Frey.Katie
broader: Astronomical location
definition: The imaginary straight line connecting the object and the objective lens of the viewing device.
modified: 2020-11-10T18:30:53.863Z
modified: 2020-11-10T18:30:44.112Z
type: Concept

Astronomical location
type: Concept
narrower: Line of sight