Longitude of the ascending node
contributor: AAS Frey.Katie
broader: Orbital elements
definition: One of the orbital elements used to specify the orbit of an object in space. It is the angle from the reference direction, called the origin of longitude, to the direction of the ascending node, measured in the reference plane.
modified: 2020-11-10T18:35:22.392Z
modified: 2020-11-10T18:35:12.306Z
type: Concept

Orbital elements
type: Concept
narrower: Longitude of the ascending node